BDBM162904 US9056865, A-31
SMILES CN(C)CC(=O)NC1CCN(CC1)c1cc(c(Cl)cn1)-c1ncccc1C
InChI Key InChIKey=AWKXNZGHJLWBIP-UHFFFAOYSA-N
Data  1 IC50
  Tab Delimited (TSV)   2D SDfile   Computed 3D by Vconf -m prep SDfile
Find this compound or compounds like it in BindingDB:
Activity Spreadsheet -- Enzyme Inhibition Constant Data from BindingDB
Found 1 hit for monomerid = 162904
TargetSmoothened homolog(Homo sapiens (Human))
Pfizer
US Patent
LigandPNGBDBM162904(US9056865, A-31)
Affinity DataIC50:  43.4nMT: 2°C. Assay description: For the binding competition assay, 100 μL of Assay Buffer was added to all the wells of a 96 well GF/B filter plate (Millipore MultiScreen-HTS-F...
In DepthDetails US Patent