BDBM163078 US9062026, Table III, Compound 6
SMILES COc1cccc2c(NCc3ccccc3)nc(nc12)N1CCOc2ccccc12
InChI Key InChIKey=IYXHYFRAECMMNU-UHFFFAOYSA-N
Data  1 IC50
  Tab Delimited (TSV)   2D SDfile   Computed 3D by Vconf -m prep SDfile
Find this compound or compounds like it in BindingDB:
Activity Spreadsheet -- Enzyme Inhibition Constant Data from BindingDB
Found 1 hit for monomerid = 163078
TargetTransitional endoplasmic reticulum ATPase(Homo sapiens (Human))
Cleave Biosciences
US Patent
LigandPNGBDBM163078(US9062026, Table III, Compound 6)
Affinity DataIC50: <5.00E+3nMpH: 7.5 T: 2°C. Assay description: The ATPase assay is performed according the following protocol: Purified enzyme (20 nM p97), substrate (20 uM ATP) and a dose titration of compounds ...
Ligand InfoPC cidPC sid
In DepthDetails US Patent