BDBM163130 US9062026, Table III, Compound 58
SMILES CC(=O)N1Cc2nc(nc(NCc3ccccc3)c2C1)-n1c(C)cc2ccccc12
InChI Key InChIKey=ROBRRYPDZPRDFQ-UHFFFAOYSA-N
Data  1 IC50
  Tab Delimited (TSV)   2D SDfile   Computed 3D by Vconf -m prep SDfile
Find this compound or compounds like it in BindingDB:
Activity Spreadsheet -- Enzyme Inhibition Constant Data from BindingDB
Found 1 hit for monomerid = 163130
TargetTransitional endoplasmic reticulum ATPase(Homo sapiens (Human))
Cleave Biosciences
US Patent
LigandPNGBDBM163130(US9062026, Table III, Compound 58)
Affinity DataIC50: <2.00E+3nMpH: 7.5 T: 2°C. Assay description: The ATPase assay is performed according the following protocol: Purified enzyme (20 nM p97), substrate (20 uM ATP) and a dose titration of compounds ...
In DepthDetails US Patent