BDBM163168 US9062045, 7
SMILES Cn1cc(cn1)-c1cc(F)c2nnc(Sc3ccc4ncc(NC5CC(C)(C)NC(C)(C)C5)cc4c3)n2c1
InChI Key InChIKey=SNOPKQMIPVHJEZ-UHFFFAOYSA-N
Data  1 IC50
  Tab Delimited (TSV)   2D SDfile   Computed 3D by Vconf -m prep SDfile
Find this compound or compounds like it in BindingDB:
Activity Spreadsheet -- Enzyme Inhibition Constant Data from BindingDB
Found 1 hit for monomerid = 163168
TargetHepatocyte growth factor receptor(Homo sapiens (Human))
Novartis
US Patent
LigandPNGBDBM163168(US9062045, 7)
Affinity DataIC50:  3nM. Assay description: The kinase assay is based on the LanthaScreen technology. LanthaScreen is the detection of Time-Resolved Fluorescence Resonance Energy Transfer (TR-F...
In DepthDetails US Patent