BDBM163240 US9062045, 84
SMILES C\C(=N/O)c1ccc2nnc(Sc3ccc4ncc(NC5CCOCC5)cc4c3)n2c1
InChI Key InChIKey=LJOSGGWJLWLDKS-MZJWZYIUSA-N
Data  2 IC50
  Tab Delimited (TSV)   2D SDfile   Computed 3D by Vconf -m prep SDfile
Find this compound or compounds like it in BindingDB:
Activity Spreadsheet -- Enzyme Inhibition Constant Data from BindingDB
Found 2 hits for monomerid = 163240
TargetHepatocyte growth factor receptor(Homo sapiens (Human))
Novartis
US Patent
LigandPNGBDBM163240(US9062045, 84)
Affinity DataIC50:  8nM. Assay description: The kinase assay is based on the LanthaScreen technology. LanthaScreen is the detection of Time-Resolved Fluorescence Resonance Energy Transfer (TR-F...
In DepthDetails US Patent
TargetcGMP-inhibited 3',5'-cyclic phosphodiesterase 3A/3B(Homo sapiens (Human))
Novartis
US Patent
LigandPNGBDBM163240(US9062045, 84)
Affinity DataIC50:  6.00E+3nM. Assay description: The kinase assay is based on the LanthaScreen technology. LanthaScreen is the detection of Time-Resolved Fluorescence Resonance Energy Transfer (TR-F...
In DepthDetails US Patent