BDBM163345 US9687479, 246 3-1-[(2-chlorophenyl)carbonyl]-5-[(5-chlorothiophen-2-yl)methyl]amino-1H-pyrazol-3-yl-1-(pyridin-2-ylmethyl)-1,2-dihydropyridin-2-one
SMILES Clc1ccc(CNc2cc(nn2C(=O)c2ccccc2Cl)-c2cccn(Cc3ccccn3)c2=O)s1
InChI Key InChIKey=KIQPDIDPZVYRMD-UHFFFAOYSA-N
Data  1 IC50
  Tab Delimited (TSV)   2D SDfile   Computed 3D by Vconf -m prep SDfile
Find this compound or compounds like it in BindingDB:
Activity Spreadsheet -- Enzyme Inhibition Constant Data from BindingDB
Found 1 hit for monomerid = 163345
TargetProthrombin(Homo sapiens (Human))
Verseon
US Patent
LigandPNGBDBM163345(US9687479, 246 3-1-[(2-chlorophenyl)carbonyl]-5-[(...)
Affinity DataIC50: <100nMpH: 7.4 T: 2°C. Assay description: Human thrombin was obtained from Haematologic Technologies Inc. The chromogenic substrate S-2238 was obtained from DiaPharma. Thrombin was assayed in...
Ligand InfoPC cidPC sid
In DepthDetails US Patent