BDBM163348 US9687479, 248 3-1-[(2-chlorophenyl)carbonyl]-5-[(5-chlorothiophen-2-yl)methyl]amino-1H-pyrazol-3-yl-1-(pyridin-4-ylmethyl)-1,2-dihydropyridin-2-one
SMILES Clc1ccc(CNc2cc(nn2C(=O)c2ccccc2Cl)-c2cccn(Cc3ccncc3)c2=O)s1
InChI Key InChIKey=VDOXVFDIROWWHE-UHFFFAOYSA-N
Data  3 IC50
  Tab Delimited (TSV)   2D SDfile   Computed 3D by Vconf -m prep SDfile
Find this compound or compounds like it in BindingDB:
Activity Spreadsheet -- Enzyme Inhibition Constant Data from BindingDB
Found 3 hits for monomerid = 163348
TargetProthrombin(Homo sapiens (Human))
Verseon
US Patent
LigandPNGBDBM163348(US9687479, 248 3-1-[(2-chlorophenyl)carbonyl]-5-[(...)
Affinity DataIC50: <100nMpH: 7.4 T: 2°C. Assay description: Human thrombin was obtained from Haematologic Technologies Inc. The chromogenic substrate S-2238 was obtained from DiaPharma. Thrombin was assayed in...
Ligand InfoPC cidPC sid
In DepthDetails US Patent
TargetPlasma kallikrein(Homo sapiens (Human))
Verseon
US Patent
LigandPNGBDBM163348(US9687479, 248 3-1-[(2-chlorophenyl)carbonyl]-5-[(...)
Affinity DataIC50:  550nMpH: 7.4 T: 2°C. Assay description: Human KLKB1 protein was obtained from Enzyme Research Labs. The chromogenic substrate S-2302 was obtained from DiaPharma. KLKB1 was assayed in buffer...
Ligand InfoPC cidPC sid
In DepthDetails US Patent
TargetKallikrein-1(Homo sapiens (Human))
Verseon
US Patent
LigandPNGBDBM163348(US9687479, 248 3-1-[(2-chlorophenyl)carbonyl]-5-[(...)
Affinity DataIC50: >1.00E+5nMpH: 7.5 T: 2°C. Assay description: Recombinant human tissue kallikrein (KLK1) was obtained from R&D Systems. Pro-Phe-Arg-AMC (I-1295) substrate was obtained from Bachem. KLK1 enzyme is...
Ligand InfoPC cidPC sid
In DepthDetails US Patent