BDBM163420 US9687479, 287 N-[(5-chlorothiophen-2-yl)methyl]-1-[(4-methyloxan-4-yl)carbonyl]-3-(pyridin-2-yl)-1H-pyrazol-5-amine
SMILES CC1(CCOCC1)C(=O)n1nc(cc1NCc1ccc(Cl)s1)-c1ccccn1
InChI Key InChIKey=BQWCAFQHPZYVRU-UHFFFAOYSA-N
Data  1 IC50
  Tab Delimited (TSV)   2D SDfile   Computed 3D by Vconf -m prep SDfile
Find this compound or compounds like it in BindingDB:
Activity Spreadsheet -- Enzyme Inhibition Constant Data from BindingDB
Found 1 hit for monomerid = 163420
TargetPlasma kallikrein(Homo sapiens (Human))
Verseon
US Patent
LigandPNGBDBM163420(US9687479, 287 N-[(5-chlorothiophen-2-yl)methyl]-1...)
Affinity DataIC50:  5.50E+4nMpH: 7.4 T: 2°C. Assay description: Human KLKB1 protein was obtained from Enzyme Research Labs. The chromogenic substrate S-2302 was obtained from DiaPharma. KLKB1 was assayed in buffer...
Ligand InfoPC cidPC sid
In DepthDetails US Patent