BDBM163629 SR-3970
SMILES CCCCCNNC(=O)c1ccc(Br)cc1
InChI Key InChIKey=FSOILGKPVXNZLM-UHFFFAOYSA-N
Data  5 IC50
  Tab Delimited (TSV)   2D SDfile   Computed 3D by Vconf -m prep SDfile
Find this compound or compounds like it in BindingDB:
Activity Spreadsheet -- Enzyme Inhibition Constant Data from BindingDB
Found 5 hits for monomerid = 163629
TargetHistone deacetylase 1/Nuclear receptor corepressor 2 [395-498](Homo sapiens (Human))
University Of Florida College Of Medicine
LigandPNGBDBM163629(SR-3970)
Affinity DataIC50:  1.87E+3nM. Assay description: Purified HDAC1, HDAC2, and HDAC3 (in complex with the deacetylase activation domain of the human NCOR2 (amino acids 395¿498)) were obtained from BPS ...
In DepthDetails ArticlePubMed
TargetHistone deacetylase 2/Nuclear receptor corepressor 2 [395-498](Homo sapiens (Human))
University Of Florida College Of Medicine
LigandPNGBDBM163629(SR-3970)
Affinity DataIC50:  1.92E+3nM. Assay description: Purified HDAC1, HDAC2, and HDAC3 (in complex with the deacetylase activation domain of the human NCOR2 (amino acids 395¿498)) were obtained from BPS ...
In DepthDetails ArticlePubMed
TargetHistone deacetylase 8(Homo sapiens (Human))
University Of Florida College Of Medicine
LigandPNGBDBM163629(SR-3970)
Affinity DataIC50:  4.87E+3nM. Assay description: Purified HDAC1, HDAC2, and HDAC3 (in complex with the deacetylase activation domain of the human NCOR2 (amino acids 395¿498)) were obtained from BPS ...
In DepthDetails ArticlePubMed
TargetHistone deacetylase 6(Homo sapiens (Human))
University Of Florida College Of Medicine
LigandPNGBDBM163629(SR-3970)
Affinity DataIC50:  5.73E+3nM. Assay description: Purified HDAC1, HDAC2, and HDAC3 (in complex with the deacetylase activation domain of the human NCOR2 (amino acids 395¿498)) were obtained from BPS ...
In DepthDetails ArticlePubMed
TargetHistone deacetylase 3/Nuclear receptor corepressor 2 [395-498](Homo sapiens (Human))
University Of Florida College Of Medicine
LigandPNGBDBM163629(SR-3970)
Affinity DataIC50:  920nM. Assay description: Purified HDAC1, HDAC2, and HDAC3 (in complex with the deacetylase activation domain of the human NCOR2 (amino acids 395¿498)) were obtained from BPS ...
In DepthDetails ArticlePubMed