BDBM164681 US9067871, 160
SMILES Cn1cnc(c1)S(=O)(=O)NCCOc1ccc2CCC(C(Cc3cc(F)cc(Cl)c3)c2c1)N1CCC1
InChI Key InChIKey=ABJBBSNUAXERJM-UHFFFAOYSA-N
Data  1 KI
  Tab Delimited (TSV)   2D SDfile   Computed 3D by Vconf -m prep SDfile
Find this compound or compounds like it in BindingDB:
Activity Spreadsheet -- Enzyme Inhibition Constant Data from BindingDB
Found 1 hit for monomerid = 164681
TargetSodium- and chloride-dependent glycine transporter 1(Homo sapiens (Human))
Abbvie Deutschland
US Patent
LigandPNGBDBM164681(US9067871, 160)
Affinity DataKi: <10nM. Assay description: Radioligand binding to human GlyT1c transporter-expressing membranes was carried out as described in Mezler et al., Molecular Pharmacology 74:1705-17...
In DepthDetails US Patent