BDBM1649 14-chloro-2-ethyl-10-methyl-2,4,10-triazatricyclo[9.4.0.0^{3,8}]pentadeca-1(11),3(8),4,6,12,14-hexaen-9-one::Pyridobenzodiazepinone deriv. 68
SMILES CCN1c2cc(Cl)ccc2N(C)C(=O)c2cccnc12
InChI Key InChIKey=BHJPHEXSIGFNTB-UHFFFAOYSA-N
Data  1 IC50
  Tab Delimited (TSV)   2D SDfile   Computed 3D by Vconf -m prep SDfile
Find this compound or compounds like it in BindingDB:
Activity Spreadsheet -- Enzyme Inhibition Constant Data from BindingDB
Found 1 hit for monomerid = 1649
TargetGag-Pol polyprotein [600-1027,R876K]/[600-1155](Human immunodeficiency virus type 1)
Boehringer Ingelheim Pharmaceuticals
LigandPNGBDBM1649(14-chloro-2-ethyl-10-methyl-2,4,10-triazatricyclo[...)
Affinity DataIC50:  170nMpH: 7.8 T: 2°C. Assay description: The IC50 of reverse transcriptase is the concentration that inhibits 50% of recombinant HIV-1 RT RNA-directed DNA polymerase activity in vitro.
In DepthDetails ArticlePubMed