BDBM164950 US10166239, Ex. 3-45::US11406644, Example 3-45::US9067914, Ex. 3-45
SMILES COc1ccc(COc2ccc(cc2OC)C(C)n2c(N)nc3cc(ccc23)-c2cnn(C)c2)cn1
InChI Key InChIKey=COGWCSCPIYIKOV-UHFFFAOYSA-N
Data  12 IC50
  Tab Delimited (TSV)   2D SDfile   Computed 3D by Vconf -m prep SDfile
Find this compound or compounds like it in BindingDB:
Activity Spreadsheet -- Enzyme Inhibition Constant Data from BindingDB
Found 12 hits for monomerid = 164950
TargetHigh affinity nerve growth factor receptor(Homo sapiens (Human))
Genzyme
US Patent
LigandPNGBDBM164950(US10166239, Ex. 3-45 | US11406644, Example 3-45 | ...)
Affinity DataIC50:  3nMpH: 7.5 T: 2°C. Assay description: Reagents and consumables were purchased from Sigma Aldrich, Carna Biosciences, or Caliper Life Sciences. All assay reaction conditions for IC50 deter...
In DepthDetails US Patent
TargetBDNF/NT-3 growth factors receptor(Homo sapiens (Human))
Genzyme
US Patent
LigandPNGBDBM164950(US10166239, Ex. 3-45 | US11406644, Example 3-45 | ...)
Affinity DataIC50:  1nMpH: 7.5 T: 2°C. Assay description: Reagents and consumables were purchased from Sigma Aldrich, Carna Biosciences, or Caliper Life Sciences. All assay reaction conditions for IC50 deter...
In DepthDetails US Patent
TargetMacrophage colony-stimulating factor 1 receptor(Homo sapiens (Human))
Genzyme
US Patent
LigandPNGBDBM164950(US10166239, Ex. 3-45 | US11406644, Example 3-45 | ...)
Affinity DataIC50:  73nMpH: 7.5 T: 2°C. Assay description: Reagents and consumables were purchased from Sigma Aldrich, Carna Biosciences, or Caliper Life Sciences. All assay reaction conditions for IC50 deter...
In DepthDetails US Patent
TargetHigh affinity nerve growth factor receptor(Homo sapiens (Human))
Genzyme
US Patent
LigandPNGBDBM164950(US10166239, Ex. 3-45 | US11406644, Example 3-45 | ...)
Affinity DataIC50:  3nM. Assay description: In a 384 well polypropylene plate, TrkA (0.4 nM, Carna 08-186) was pre-incubated in a 100 mM Hepes-NaOH pH 7.5 buffer containing 0.01% Triton X-100, ...
In DepthDetails US Patent
TargetBDNF/NT-3 growth factors receptor(Homo sapiens (Human))
Genzyme
US Patent
LigandPNGBDBM164950(US10166239, Ex. 3-45 | US11406644, Example 3-45 | ...)
Affinity DataIC50:  1nM. Assay description: In a 384 well polypropylene plate, TrkB (0.6 nM, Carna 08-187) was pre-incubated in a 100 mM Hepes-NaOH pH 7.5 buffer containing 0.01% Triton X-100, ...
In DepthDetails US Patent
TargetMacrophage colony-stimulating factor 1 receptor(Homo sapiens (Human))
Genzyme
US Patent
LigandPNGBDBM164950(US10166239, Ex. 3-45 | US11406644, Example 3-45 | ...)
Affinity DataIC50:  73nM. Assay description: Reagents and consumables were purchased from Sigma Aldrich, Carna Biosciences, or Caliper Life Sciences. All assay reaction conditions for IC50 deter...
In DepthDetails US Patent
TargetHigh affinity nerve growth factor receptor(Homo sapiens (Human))
Genzyme
US Patent
LigandPNGBDBM164950(US10166239, Ex. 3-45 | US11406644, Example 3-45 | ...)
Affinity DataIC50:  3nM. Assay description: Reagents and consumables were purchased from Sigma Aldrich, Carna Biosciences, or Caliper Life Sciences. All assay reaction conditions for IC50 deter...
In DepthDetails US Patent
TargetBDNF/NT-3 growth factors receptor(Homo sapiens (Human))
Genzyme
US Patent
LigandPNGBDBM164950(US10166239, Ex. 3-45 | US11406644, Example 3-45 | ...)
Affinity DataIC50:  1nM. Assay description: Reagents and consumables were purchased from Sigma Aldrich, Carna Biosciences, or Caliper Life Sciences. All assay reaction conditions for IC50 deter...
In DepthDetails US Patent
TargetMacrophage colony-stimulating factor 1 receptor(Homo sapiens (Human))
Genzyme
US Patent
LigandPNGBDBM164950(US10166239, Ex. 3-45 | US11406644, Example 3-45 | ...)
Affinity DataIC50:  73nM. Assay description: Reagents and consumables were purchased from Sigma Aldrich, Carna Biosciences, or Caliper Life Sciences. All assay reaction conditions for IC50 deter...
In DepthDetails US Patent
TargetHigh affinity nerve growth factor receptor(Homo sapiens (Human))
Genzyme
US Patent
LigandPNGBDBM164950(US10166239, Ex. 3-45 | US11406644, Example 3-45 | ...)
Affinity DataIC50:  3nM. Assay description: Reagents and consumables were purchased from Sigma Aldrich, Carna Biosciences, or Caliper Life Sciences. All assay reaction conditions for IC50 deter...
In DepthDetails US Patent
TargetBDNF/NT-3 growth factors receptor(Homo sapiens (Human))
Genzyme
US Patent
LigandPNGBDBM164950(US10166239, Ex. 3-45 | US11406644, Example 3-45 | ...)
Affinity DataIC50:  1nM. Assay description: Reagents and consumables were purchased from Sigma Aldrich, Carna Biosciences, or Caliper Life Sciences. All assay reaction conditions for IC50 deter...
In DepthDetails US Patent
TargetMacrophage colony-stimulating factor 1 receptor(Homo sapiens (Human))
Genzyme
US Patent
LigandPNGBDBM164950(US10166239, Ex. 3-45 | US11406644, Example 3-45 | ...)
Affinity DataIC50:  73nM. Assay description: In a 384 well polypropylene plate, c-FMS (0.14 nM, Carna 08-155) was pre-incubated in a 100 mM Hepes-NaOH pH 7.5 buffer containing 0.01% Triton X-100...
In DepthDetails US Patent