BDBM165602 US8168651, Compound TABLE 17.137::US9062043, Table 14, Compound 137
SMILES OC(=O)c1ccc2c3sccc3c(Nc3cccc(c3)S(=O)(=O)NC3CC3)nc2c1
InChI Key InChIKey=HMKQDAGMLWOISR-UHFFFAOYSA-N
Data  2 IC50
  Tab Delimited (TSV)   2D SDfile   Computed 3D by Vconf -m prep SDfile
Find this compound or compounds like it in BindingDB:
Activity Spreadsheet -- Enzyme Inhibition Constant Data from BindingDB
Found 2 hits for monomerid = 165602
TargetCasein kinase II subunit alpha(Homo sapiens (Human))
Cylene Pharmaceuticals
US Patent
LigandPNGBDBM165602(US8168651, Compound TABLE 17.137 | US9062043, Tabl...)
Affinity DataIC50:  116nM. Assay description: Test compounds in aqueous solution were added at a volume of 10 microliters, to a reaction mixture comprising 10 microliters Assay Dilution Buffer (A...
In DepthDetails US Patent
TargetCasein kinase II subunit alpha(Homo sapiens (Human))
Cylene Pharmaceuticals
US Patent
LigandPNGBDBM165602(US8168651, Compound TABLE 17.137 | US9062043, Tabl...)
Affinity DataIC50:  116nMpH: 7.2Assay Description:Test compounds in aqueous solution were added at a volume of 10 microliters, to a reaction mixture comprising 10 microliters Assay Dilution Buffer (A...
In DepthDetails US Patent