BDBM16562 (2S)-1-(2,4,6-trimethylphenyl)-3-{[5-(3-methyl-1H-indazol-5-yl)pyridin-3-yl]oxy}propan-2-amine::5-{5-[(2S)-2-amino-3-(2,4,6-trimethylphenyl)propoxy]pyridin-3-yl}-3-methyl-1H-indazole::indazole-pyridine, 13aa
SMILES Cc1n[nH]c2ccc(cc12)-c1cncc(OC[C@@H](N)Cc2c(C)cc(C)cc2C)c1
InChI Key InChIKey=OXLXYCXLRBZDGD-NRFANRHFSA-N
Data  1 IC50
  Tab Delimited (TSV)   2D SDfile   Computed 3D by Vconf -m prep SDfile
Find this compound or compounds like it in BindingDB:
Activity Spreadsheet -- Enzyme Inhibition Constant Data from BindingDB
Found 1 hit for monomerid = 16562
LigandPNGBDBM16562((2S)-1-(2,4,6-trimethylphenyl)-3-{[5-(3-methyl-1H-...)
Affinity DataIC50:  39nM. Assay description: The kinase assay uses His-Akt1 and a biotinylated peptide as substrate. The biotinylated peptides were immobilized on streptavidin-coated FLASH plat...
In DepthDetails ArticlePubMed