BDBM165712 US9067922, 46
SMILES CCc1ccccc1Oc1ccc(cc1C#N)S(=O)(=O)Nc1ccc(F)cn1
InChI Key InChIKey=NEPMNJPNOJZGGK-UHFFFAOYSA-N
Data  1 IC50
  Tab Delimited (TSV)   2D SDfile   Computed 3D by Vconf -m prep SDfile
Find this compound or compounds like it in BindingDB:
Activity Spreadsheet -- Enzyme Inhibition Constant Data from BindingDB
Found 1 hit for monomerid = 165712
TargetSolute carrier family 22 member 12(Homo sapiens (Human))
Pfizer
US Patent
LigandPNGBDBM165712(US9067922, 46)
Affinity DataIC50:  107nMpH: 7.4Assay Description:Assay compound plates were prepared by diluting the compounds of formula (I) with chloride-free buffer (125 mM Na-gluconate, 4.8 mM K-gluconate, 1.3 ...
In DepthDetails US Patent