BDBM165898 US9067922, 239
SMILES OCc1ncc(Oc2ccc(c(F)c2)S(=O)(=O)Nc2ccc(F)cn2)cc1Cl
InChI Key InChIKey=SFYSDPWAVSQNHN-UHFFFAOYSA-N
Data  1 IC50
  Tab Delimited (TSV)   2D SDfile   Computed 3D by Vconf -m prep SDfile
Find this compound or compounds like it in BindingDB:
Activity Spreadsheet -- Enzyme Inhibition Constant Data from BindingDB
Found 1 hit for monomerid = 165898
TargetSolute carrier family 22 member 12(Homo sapiens (Human))
Pfizer
US Patent
LigandPNGBDBM165898(US9067922, 239)
Affinity DataIC50:  2nMpH: 7.4Assay Description:Assay compound plates were prepared by diluting the compounds of formula (I) with chloride-free buffer (125 mM Na-gluconate, 4.8 mM K-gluconate, 1.3 ...
Ligand InfoPC cidPC sid
In DepthDetails US Patent