BDBM16616 6-{[(2,3-dichlorophenyl)methane]sulfonyl}-2,3-dihydropyridazin-3-one::Benzyl-Substituted Sulfonylpyridazinone, 15e
SMILES Clc1cccc(CS(=O)(=O)c2ccc(=O)[nH]n2)c1Cl
InChI Key InChIKey=ZAIAVBMBDRUAAP-UHFFFAOYSA-N
Data  1 IC50
  Tab Delimited (TSV)   2D SDfile   Computed 3D by Vconf -m prep SDfile
Find this compound or compounds like it in BindingDB:
Activity Spreadsheet -- Enzyme Inhibition Constant Data from BindingDB
Found 1 hit for monomerid = 16616
TargetAldo-keto reductase family 1 member B1(Homo sapiens (Human))
Pfizer
LigandPNGBDBM16616(6-{[(2,3-dichlorophenyl)methane]sulfonyl}-2,3-dihy...)
Affinity DataIC50:  35nM. Assay description: The activity of the enzyme was determined spectrophotometrically by monitoring the change in absorbance at 340 nm, which is due to the disappearance ...
In DepthDetails ArticlePubMed