BDBM166235 US9067949, 237::US9067949, 92
SMILES COc1cc(Oc2ccccc2)cc2c3CNCCc3oc12
InChI Key InChIKey=CECYNUNZUDDMMN-UHFFFAOYSA-N
Data  2 KI
  Tab Delimited (TSV)   2D SDfile   Computed 3D by Vconf -m prep SDfile
Find this compound or compounds like it in BindingDB:
Activity Spreadsheet -- Enzyme Inhibition Constant Data from BindingDB
Found 2 hits for monomerid = 166235
Target5-hydroxytryptamine receptor 6(Homo sapiens (Human))
Albany Molecular Research
US Patent
LigandPNGBDBM166235(US9067949, 237 | US9067949, 92)
Affinity DataKi:  645nM ΔG°:  -8.44kcal/molepH: 7.5 T: 2°C. Assay description: For binding analysis vs. the human receptor, samples were incubated in 50 mM Tris-HCl, pH 7.5, 5 mM MgCl2, 1 mM EDTA (4% DMSO final) with 10 nM [N-me...
In DepthDetails US Patent
Target5-hydroxytryptamine receptor 6(Homo sapiens (Human))
Albany Molecular Research
US Patent
LigandPNGBDBM166235(US9067949, 237 | US9067949, 92)
Affinity DataKi:  645nM ΔG°:  -8.44kcal/molepH: 7.5 T: 2°C. Assay description: For binding analysis vs. the human receptor, samples were incubated in 50 mM Tris-HCl, pH 7.5, 5 mM MgCl2, 1 mM EDTA (4% DMSO final) with 10 nM [N-me...
In DepthDetails US Patent