BDBM166445 US9073853, 4
SMILES COc1cc(CN(C[C@H]2CC[C@@H](CC2)C(O)=O)[C@@H](C)c2ccc3OCCc3c2)ccc1OCCN1C(=O)CCC1=O
InChI Key InChIKey=WDNRFEUNXWKOAC-FIXSFTCYSA-N
Data  1 IC50
  Tab Delimited (TSV)   2D SDfile   Computed 3D by Vconf -m prep SDfile
Find this compound or compounds like it in BindingDB:
Activity Spreadsheet -- Enzyme Inhibition Constant Data from BindingDB
Found 1 hit for monomerid = 166445
TargetC-X-C chemokine receptor type 3(Homo sapiens (Human))
Sanofi
US Patent
LigandPNGBDBM166445(US9073853, 4)
Affinity DataIC50:  37nM. Assay description: Competition radioligand binding assays were performed to determine the in vitro potency of the newly synthesized, unlabeled test compounds to displac...
In DepthDetails US Patent