BDBM166474 US9073853, 33
SMILES CC(N(C[C@H]1CC[C@@H](CC1)C(O)=O)Cc1ccc(OCCN2C(=O)CSC2=O)c(C)c1)c1ccc2OCCc2c1
InChI Key InChIKey=ONRHSVGYQMACQK-WDDOAMHJSA-N
Data  1 IC50
  Tab Delimited (TSV)   2D SDfile   Computed 3D by Vconf -m prep SDfile
Find this compound or compounds like it in BindingDB:
Activity Spreadsheet -- Enzyme Inhibition Constant Data from BindingDB
Found 1 hit for monomerid = 166474
TargetC-X-C chemokine receptor type 3(Homo sapiens (Human))
Sanofi
US Patent
LigandPNGBDBM166474(US9073853, 33)
Affinity DataIC50:  42nM. Assay description: Competition radioligand binding assays were performed to determine the in vitro potency of the newly synthesized, unlabeled test compounds to displac...
In DepthDetails US Patent