BDBM166685 Octyl (2E)‐3‐(3,4‐dihydroxyphenyl)prop‐2‐enoate (E6)
SMILES CCCCCCCCOC(=O)\C=C\c1ccc(O)c(O)c1
InChI Key InChIKey=RXIINIWPQBLXAP-PKNBQFBNSA-N
Data  2 IC50
  Tab Delimited (TSV)   2D SDfile   Computed 3D by Vconf -m prep SDfile
Find this compound or compounds like it in BindingDB:
Activity Spreadsheet -- Enzyme Inhibition Constant Data from BindingDB
Found 2 hits for monomerid = 166685
TargetIntegrase(Human immunodeficiency virus 1)
Zhejiang University
Curated by ChEMBL
LigandPNGBDBM166685(Octyl (2E)‐3‐(3,4‐dihydroxypheny...)
Affinity DataIC50: >1.00E+5nM. Assay description: Inhibition of HIV1 integrase by ELISA
In DepthDetails ArticlePubMed
TargetCaspase-1(Homo sapiens (Human))
Depaul University
LigandPNGBDBM166685(Octyl (2E)‐3‐(3,4‐dihydroxypheny...)
Affinity DataIC50:  840nMpH: 7.5 T: 2°C. Assay description: All assays were performed at 100 µL total volume in triplicate and monitored for 60 minutes at room temperature in a 96-well plate format in HEPES Bu...
In DepthDetails ArticlePubMed