BDBM166828 US10604504, Example 241::US11623921, Example 241::US9688629, 241::US9802915, Example 241::US9920031, Example 241
SMILES Cc1[nH]c2c(ccc(-c3cccc4CN(CCc34)C(=O)C=C)c2c1C)C(N)=O
InChI Key InChIKey=OFKJFJCKOLKYCY-UHFFFAOYSA-N
Data  5 IC50
  Tab Delimited (TSV)   2D SDfile   Computed 3D by Vconf -m prep SDfile
Find this compound or compounds like it in BindingDB:
Activity Spreadsheet -- Enzyme Inhibition Constant Data from BindingDB
Found 5 hits for monomerid = 166828
TargetTyrosine-protein kinase BTK(Homo sapiens (Human))
Bristol-Myers Squibb
US Patent
LigandPNGBDBM166828(US10604504, Example 241 | US11623921, Example 241 ...)
Affinity DataIC50:  0.600nMpH: 7.4 T: 2°C. Assay description: To V-bottom 384-well plates were added test compounds, human recombinant Btk (1 nM, Invitrogen Corporation), fluoresceinated peptide (1.5 μM), A...
Ligand InfoPC cidPC sid
In DepthDetails US Patent
TargetTyrosine-protein kinase BTK(Homo sapiens (Human))
Bristol-Myers Squibb
US Patent
LigandPNGBDBM166828(US10604504, Example 241 | US11623921, Example 241 ...)
Affinity DataIC50:  0.600nM. Assay description: To V-bottom 384-well plates were added test compounds, human recombinant Btk (1 nM, Invitrogen Corporation), fluoresceinated peptide (1.5 μM), A...
Ligand InfoPC cidPC sid
In DepthDetails US Patent
TargetTyrosine-protein kinase BTK(Homo sapiens (Human))
Bristol-Myers Squibb
US Patent
LigandPNGBDBM166828(US10604504, Example 241 | US11623921, Example 241 ...)
Affinity DataIC50:  0.600nM. Assay description: To V-bottom 384-well plates were added test compounds, human recombinant Btk (1 nM, Invitrogen Corporation), fluoresceinated peptide (1.5 μM), A...
Ligand InfoPC cidPC sid
In DepthDetails US Patent
TargetTyrosine-protein kinase BTK(Homo sapiens (Human))
Bristol-Myers Squibb
US Patent
LigandPNGBDBM166828(US10604504, Example 241 | US11623921, Example 241 ...)
Affinity DataIC50:  0.600nM. Assay description: To V-bottom 384-well plates were added test compounds, human recombinant Btk (1 nM, Invitrogen Corporation), fluoresceinated peptide (1.5 μM), A...
Ligand InfoPC cidPC sid
In DepthDetails US Patent
TargetTyrosine-protein kinase BTK(Homo sapiens (Human))
Bristol-Myers Squibb
US Patent
LigandPNGBDBM166828(US10604504, Example 241 | US11623921, Example 241 ...)
Affinity DataIC50:  0.600nM. Assay description: To V-bottom 384-well plates were added test compounds, human recombinant Btk (1 nM, Invitrogen Corporation), fluoresceinated peptide (1.5 μM), A...
Ligand InfoPC cidPC sid
In DepthDetails US Patent