BDBM167028 US9073876, 114::US9732093, Compound 114
SMILES Nc1cnc(cn1)-c1ccc(C2CCC2)c(Oc2ccc(cn2)C#N)c1F
InChI Key InChIKey=LSQNQBHOHDVTNS-UHFFFAOYSA-N
Data  3 KI
  Tab Delimited (TSV)   2D SDfile   Computed 3D by Vconf -m prep SDfile
Find this compound or compounds like it in BindingDB:
Activity Spreadsheet -- Enzyme Inhibition Constant Data from BindingDB
Found 3 hits for monomerid = 167028
TargetFlap endonuclease 1(Homo sapiens (Human))
Janssen Pharmaceutica
US Patent
LigandPNGBDBM167028(US9073876, 114 | US9732093, Compound 114)
Affinity DataKi:  10.2nM. Assay description: The assay below is used to test the modulatory activity of compounds against FLAP. Human and mouse FLAP-encoding DNA was amplified by polymerase chai...
In DepthDetails US Patent
TargetArachidonate 5-lipoxygenase-activating protein(Homo sapiens (Human))
Janssen Pharmaceutica
US Patent
LigandPNGBDBM167028(US9073876, 114 | US9732093, Compound 114)
Affinity DataKi:  17.2nM. Assay description: The assay below is used to test the modulatory activity of compounds against FLAP. Human and mouse FLAP-encoding DNA was amplified by polymerase chai...
In DepthDetails US Patent
TargetFlap endonuclease 1(Homo sapiens (Human))
Janssen Pharmaceutica
US Patent
LigandPNGBDBM167028(US9073876, 114 | US9732093, Compound 114)
Affinity DataKi:  17.2nM. Assay description: The assay below is used to test the modulatory activity of compounds against FLAP. Human and mouse FLAP-encoding DNA was amplified by polymerase chai...
In DepthDetails US Patent