BDBM167120 US9073876, 203::US9732093, Compound 203
SMILES CC(C)(C)c1ccc(c(F)c1Oc1nccc(N)n1)-c1cnc(N)cn1
InChI Key InChIKey=VQDPRXATJIFYIO-UHFFFAOYSA-N
Data  3 KI
  Tab Delimited (TSV)   2D SDfile   Computed 3D by Vconf -m prep SDfile
Find this compound or compounds like it in BindingDB:
Activity Spreadsheet -- Enzyme Inhibition Constant Data from BindingDB
Found 3 hits for monomerid = 167120
TargetArachidonate 5-lipoxygenase-activating protein(Homo sapiens (Human))
Janssen Pharmaceutica
US Patent
LigandPNGBDBM167120(US9073876, 203 | US9732093, Compound 203)
Affinity DataKi:  6.90nM. Assay description: The assay below is used to test the modulatory activity of compounds against FLAP. Human and mouse FLAP-encoding DNA was amplified by polymerase chai...
In DepthDetails US Patent
TargetFlap endonuclease 1(Homo sapiens (Human))
Janssen Pharmaceutica
US Patent
LigandPNGBDBM167120(US9073876, 203 | US9732093, Compound 203)
Affinity DataKi:  6.90nM. Assay description: The assay below is used to test the modulatory activity of compounds against FLAP. Human and mouse FLAP-encoding DNA was amplified by polymerase chai...
In DepthDetails US Patent
TargetFlap endonuclease 1(Homo sapiens (Human))
Janssen Pharmaceutica
US Patent
LigandPNGBDBM167120(US9073876, 203 | US9732093, Compound 203)
Affinity DataKi:  6.90nM. Assay description: The assay below is used to test the modulatory activity of compounds against FLAP. Human and mouse FLAP-encoding DNA was amplified by polymerase chai...
In DepthDetails US Patent