BDBM167482 US9073911, 31
SMILES Fc1ccc(cc1)-n1ccc(n1)C(=O)Nc1ccc(cc1)[C@@H]1CNCCO1
InChI Key InChIKey=BULZFDBUMKGDON-IBGZPJMESA-N
Data  2 KI
  Tab Delimited (TSV)   2D SDfile   Computed 3D by Vconf -m prep SDfile
Find this compound or compounds like it in BindingDB:
Activity Spreadsheet -- Enzyme Inhibition Constant Data from BindingDB
Found 2 hits for monomerid = 167482
TargetTrace amine-associated receptor 1(Mus musculus (Mouse))
Hoffmann-La Roche
US Patent
LigandPNGBDBM167482(US9073911, 31)
Affinity DataKi:  1.30nMpH: 7.4Assay Description:The TAAR1 radioligand 3[H](S)-4-[(ethyl-phenyl-amino)-methyl]-4,5-dihydro-oxazol-2-ylamine (described in WO 2008/098857) was used at a concentration ...
In DepthDetails US Patent
TargetTrace amine-associated receptor 1(Rattus norvegicus (Rat))
Hoffmann-La Roche
US Patent
LigandPNGBDBM167482(US9073911, 31)
Affinity DataKi:  2.40nMpH: 7.4Assay Description:The TAAR1 radioligand 3[H](S)-4-[(ethyl-phenyl-amino)-methyl]-4,5-dihydro-oxazol-2-ylamine (described in WO 2008/098857) was used at a concentration ...
In DepthDetails US Patent