BDBM167563 US9073922, 48::US9796708, Example 48
SMILES Clc1ccc(NCC2CCOCC2)nc1-c1ccnc2[nH]c(cc12)C1CCNCC1
InChI Key InChIKey=LGNFTAVRKGAUOE-UHFFFAOYSA-N
Data  2 IC50
  Tab Delimited (TSV)   2D SDfile   Computed 3D by Vconf -m prep SDfile
Find this compound or compounds like it in BindingDB:
Activity Spreadsheet -- Enzyme Inhibition Constant Data from BindingDB
Found 2 hits for monomerid = 167563
TargetCyclin-T1/Cyclin-dependent kinase 9(Homo sapiens (Human))
Abbvie
US Patent
LigandPNGBDBM167563(US9073922, 48 | US9796708, Example 48)
Affinity DataIC50:  81nM. Assay description: CDK9 enzyme activities were measured using LANCE ULight TR-FRET kinase assay reagents (PerkinElmer, Waltham, Mass.). Compounds were directly added in...
In DepthDetails US Patent
TargetCyclin-dependent kinase 9(Homo sapiens (Human))
Abbvie
US Patent
LigandPNGBDBM167563(US9073922, 48 | US9796708, Example 48)
Affinity DataIC50:  81nM. Assay description: CDK9 enzyme activities were measured using LANCE ULight TR-FRET kinase assay reagents (PerkinElmer, Waltham, Mass.). Compounds were directly added in...
In DepthDetails US Patent