BDBM167705 US9073922, 192::US9796708, Example 192
SMILES O[C@@H]1CN[C@@H](CNc2ccc(Cl)c(n2)-c2ccnc3[nH]c(cc23)C2CCNCC2)C1
InChI Key InChIKey=JRLVVHBERLJGMR-CABCVRRESA-N
Data  2 IC50
  Tab Delimited (TSV)   2D SDfile   Computed 3D by Vconf -m prep SDfile
Find this compound or compounds like it in BindingDB:
Activity Spreadsheet -- Enzyme Inhibition Constant Data from BindingDB
Found 2 hits for monomerid = 167705
TargetCyclin-T1/Cyclin-dependent kinase 9(Homo sapiens (Human))
Abbvie
US Patent
LigandPNGBDBM167705(US9073922, 192 | US9796708, Example 192)
Affinity DataIC50:  810nM. Assay description: CDK9 enzyme activities were measured using LANCE ULight TR-FRET kinase assay reagents (PerkinElmer, Waltham, Mass.). Compounds were directly added in...
In DepthDetails US Patent
TargetCyclin-dependent kinase 9(Homo sapiens (Human))
Abbvie
US Patent
LigandPNGBDBM167705(US9073922, 192 | US9796708, Example 192)
Affinity DataIC50:  810nM. Assay description: CDK9 enzyme activities were measured using LANCE ULight TR-FRET kinase assay reagents (PerkinElmer, Waltham, Mass.). Compounds were directly added in...
In DepthDetails US Patent