BDBM16790 3-[(2S)-2-amino-3-phenylpropoxy]-5-{1H-pyrazolo[3,4-c]pyridin-5-yl}pyridine::pyrazolopyridine analog, 9h
SMILES N[C@H](COc1cncc(c1)-c1cc2cn[nH]c2cn1)Cc1ccccc1
InChI Key InChIKey=UPWMWRRIGPQATG-KRWDZBQOSA-N
Data  1 IC50
  Tab Delimited (TSV)   2D SDfile   Computed 3D by Vconf -m prep SDfile
Find this compound or compounds like it in BindingDB:
Activity Spreadsheet -- Enzyme Inhibition Constant Data from BindingDB
Found 1 hit for monomerid = 16790
LigandPNGBDBM16790(3-[(2S)-2-amino-3-phenylpropoxy]-5-{1H-pyrazolo[3,...)
Affinity DataIC50:  223nMpH: 7.5 T: 2°C. Assay description: The kinase assay uses His-Akt1 and a biotinylated peptide as substrate. The biotinylated peptides were immobilized on streptavidin-coated FLASH plat...
In DepthDetails ArticlePubMed