BDBM168028 US9073926, 62
SMILES C[C@@H]1NC(=O)c2cc3ccc(nc3n2[C@H]1C)C(=O)Nc1cnn(Cc2ccccc2)c1
InChI Key InChIKey=UHXBEOZTLFAXRQ-GJZGRUSLSA-N
Data  1 IC50
  Tab Delimited (TSV)   2D SDfile   Computed 3D by Vconf -m prep SDfile
Find this compound or compounds like it in BindingDB:
Activity Spreadsheet -- Enzyme Inhibition Constant Data from BindingDB
Found 1 hit for monomerid = 168028
TargetRibosomal protein S6 kinase alpha-3(Homo sapiens (Human))
Boehringer Ingelheim International
US Patent
LigandPNGBDBM168028(US9073926, 62)
Affinity DataIC50:  3nMpH: 7.5Assay Description:Human RSK2 protein, purchased from Invitrogen, is used to measure kinase activity utilizing Kinase Glo Plus (Promega) a homogeneous assay technology,...
In DepthDetails US Patent