BDBM168074 US9073931, E3
SMILES CCOC(=O)c1cnc(nc1C(F)(F)F)N1CCn2c(nc3ccc(cc23)S(C)(=O)=O)C1C(C)C
InChI Key InChIKey=VWVWWPZPLJBDBN-UHFFFAOYSA-N
Data  2 KI
  Tab Delimited (TSV)   2D SDfile   Computed 3D by Vconf -m prep SDfile
Find this compound or compounds like it in BindingDB:
Activity Spreadsheet -- Enzyme Inhibition Constant Data from BindingDB
Found 2 hits for monomerid = 168074
TargetOxysterols receptor LXR-beta(Homo sapiens (Human))
Vitae Pharmaceuticals
US Patent
LigandPNGBDBM168074(US9073931, E3)
Affinity DataKi:  1.16E+3nM ΔG°:  -8.09kcal/moleT: 2°C. Assay description: Compounds of the invention were assessed in a competition binding assay where different concentrations of compounds were incubated with the LXR ligan...
In DepthDetails US Patent
TargetOxysterols receptor LXR-alpha(Homo sapiens (Human))
Vitae Pharmaceuticals
US Patent
LigandPNGBDBM168074(US9073931, E3)
Affinity DataKi: >3.33E+3nM ΔG°: >-7.47kcal/moleT: 2°C. Assay description: Compounds of the invention were assessed in a competition binding assay where different concentrations of compounds were incubated with the LXR ligan...
In DepthDetails US Patent