BDBM168076 US9073931, E5
SMILES CC(C)C1N(CCn2c1nc1ccc(cc21)S(C)(=O)=O)c1ncc(C(N)=O)c(n1)C(F)(F)F
InChI Key InChIKey=GOMMIXQAFBFDBV-UHFFFAOYSA-N
Data  2 KI
  Tab Delimited (TSV)   2D SDfile   Computed 3D by Vconf -m prep SDfile
Find this compound or compounds like it in BindingDB:
Activity Spreadsheet -- Enzyme Inhibition Constant Data from BindingDB
Found 2 hits for monomerid = 168076
TargetOxysterols receptor LXR-beta(Homo sapiens (Human))
Vitae Pharmaceuticals
US Patent
LigandPNGBDBM168076(US9073931, E5)
Affinity DataKi: >2.50E+3nM ΔG°: >-7.64kcal/moleT: 2°C. Assay description: Compounds of the invention were assessed in a competition binding assay where different concentrations of compounds were incubated with the LXR ligan...
In DepthDetails US Patent
TargetOxysterols receptor LXR-alpha(Homo sapiens (Human))
Vitae Pharmaceuticals
US Patent
LigandPNGBDBM168076(US9073931, E5)
Affinity DataKi: >3.33E+3nM ΔG°: >-7.47kcal/moleT: 2°C. Assay description: Compounds of the invention were assessed in a competition binding assay where different concentrations of compounds were incubated with the LXR ligan...
In DepthDetails US Patent