BDBM168088 US9073931, E10b::US9073931, E10c
SMILES CCC(O)c1cnc(nc1C(F)(F)F)N1CCn2c(nc3cc(CO)c(cc23)S(C)(=O)=O)[C@H]1C(C)C
InChI Key InChIKey=OEALQQJYLLGJFL-WHCXFUJUSA-N
Data  4 KI
  Tab Delimited (TSV)   2D SDfile   Computed 3D by Vconf -m prep SDfile
Find this compound or compounds like it in BindingDB:
Activity Spreadsheet -- Enzyme Inhibition Constant Data from BindingDB
Found 4 hits for monomerid = 168088
TargetOxysterols receptor LXR-beta(Homo sapiens (Human))
Vitae Pharmaceuticals
US Patent
LigandPNGBDBM168088(US9073931, E10b | US9073931, E10c)
Affinity DataKi:  7nM ΔG°:  -11.1kcal/moleT: 2°C. Assay description: Compounds of the invention were assessed in a competition binding assay where different concentrations of compounds were incubated with the LXR ligan...
In DepthDetails US Patent
TargetOxysterols receptor LXR-beta(Homo sapiens (Human))
Vitae Pharmaceuticals
US Patent
LigandPNGBDBM168088(US9073931, E10b | US9073931, E10c)
Affinity DataKi:  7nM ΔG°:  -11.1kcal/moleT: 2°C. Assay description: Compounds of the invention were assessed in a competition binding assay where different concentrations of compounds were incubated with the LXR ligan...
In DepthDetails US Patent
TargetOxysterols receptor LXR-alpha(Homo sapiens (Human))
Vitae Pharmaceuticals
US Patent
LigandPNGBDBM168088(US9073931, E10b | US9073931, E10c)
Affinity DataKi:  72nM ΔG°:  -9.74kcal/moleT: 2°C. Assay description: Compounds of the invention were assessed in a competition binding assay where different concentrations of compounds were incubated with the LXR ligan...
In DepthDetails US Patent
TargetOxysterols receptor LXR-alpha(Homo sapiens (Human))
Vitae Pharmaceuticals
US Patent
LigandPNGBDBM168088(US9073931, E10b | US9073931, E10c)
Affinity DataKi:  106nM ΔG°:  -9.51kcal/moleT: 2°C. Assay description: Compounds of the invention were assessed in a competition binding assay where different concentrations of compounds were incubated with the LXR ligan...
In DepthDetails US Patent