BDBM168228 US9669031, 56 N-(6-((8-chloro-1,5-dioxo-1,5-dihydro-2H-spiro[imidazo[1,5-a]pyridine-3,4′-piperidin]-6-yl)amino)pyrimidin-4-yl)cyclopropanecarboxamide hydrochloride (Cpd. No. 56)
SMILES CC(C)(C)OC(=O)N1CCC2(CC1)NC(=O)c1c(Cl)cc(Nc3cc(NC(=O)C4CC4)ncn3)c(=O)n21
InChI Key InChIKey=APVPBFHXPCNODA-UHFFFAOYSA-N
Data  2 IC50
  Tab Delimited (TSV)   2D SDfile   Computed 3D by Vconf -m prep SDfile
Find this compound or compounds like it in BindingDB:
Activity Spreadsheet -- Enzyme Inhibition Constant Data from BindingDB
Found 2 hits for monomerid = 168228
TargetMAP kinase-interacting serine/threonine-protein kinase 2(Homo sapiens (Human))
Effector Therapeutics
US Patent
LigandPNGBDBM168228(US9669031, 56 N-(6-((8-chloro-1,5-dioxo-1,5-dihydr...)
Affinity DataIC50: <10nMT: 2°C. Assay description: Compounds are screened for Mnk inhibition using the ADP-Glo kinase assay kit (Promega, catalogue No. V9101). All kinase reactions are performed in Re...
Ligand InfoPC cidPC sid
In DepthDetails US Patent
TargetMAP kinase-interacting serine/threonine-protein kinase 1(Homo sapiens (Human))
Effector Therapeutics
US Patent
LigandPNGBDBM168228(US9669031, 56 N-(6-((8-chloro-1,5-dioxo-1,5-dihydr...)
Affinity DataIC50: <10nMT: 2°C. Assay description: Compounds are screened for Mnk inhibition using the ADP-Glo kinase assay kit (Promega, catalogue No. V9101). All kinase reactions are performed in Re...
Ligand InfoPC cidPC sid
In DepthDetails US Patent