BDBM168264 US9669031, 92 6-[(6-aminopyrimidin-4-yl)amino]-3-(3-chlorophenyl)-3,8-dimethyl-2H-imidazo[1,5-a]pyridine-1,5-dione (Cpd. No. 92)
SMILES Cc1cc(Nc2cc(NC(=O)OC(C)(C)C)ncn2)c(=O)n2c1C(=O)NC2(C)c1cccc(Cl)c1
InChI Key InChIKey=UXXALADLUMSSBG-UHFFFAOYSA-N
Data  2 IC50
  Tab Delimited (TSV)   2D SDfile   Computed 3D by Vconf -m prep SDfile
Find this compound or compounds like it in BindingDB:
Activity Spreadsheet -- Enzyme Inhibition Constant Data from BindingDB
Found 2 hits for monomerid = 168264
TargetMAP kinase-interacting serine/threonine-protein kinase 2(Homo sapiens (Human))
Effector Therapeutics
US Patent
LigandPNGBDBM168264(US9669031, 92 6-[(6-aminopyrimidin-4-yl)amino]-3-(...)
Affinity DataIC50: <10nMT: 2°C. Assay description: Compounds are screened for Mnk inhibition using the ADP-Glo kinase assay kit (Promega, catalogue No. V9101). All kinase reactions are performed in Re...
Ligand InfoPC cidPC sid
In DepthDetails US Patent
TargetMAP kinase-interacting serine/threonine-protein kinase 1(Homo sapiens (Human))
Effector Therapeutics
US Patent
LigandPNGBDBM168264(US9669031, 92 6-[(6-aminopyrimidin-4-yl)amino]-3-(...)
Affinity DataIC50: <10nMT: 2°C. Assay description: Compounds are screened for Mnk inhibition using the ADP-Glo kinase assay kit (Promega, catalogue No. V9101). All kinase reactions are performed in Re...
Ligand InfoPC cidPC sid
In DepthDetails US Patent