BDBM168282 US9669031, 110 8-chloro-4′,4′-difluoro-6-(pyrimidin-4-ylamino)spiro[2H-imidazo[1,5-a]pyridine-3,1′-cyclohexane]-1,5-dione hydrochloride (Cpd. No. 110)
SMILES FC1(F)CCC2(CC1)NC(=O)c1c(Cl)cc(Nc3ccncn3)c(=O)n21
InChI Key InChIKey=GGICRDSGZDXVSN-UHFFFAOYSA-N
Data  2 IC50
  Tab Delimited (TSV)   2D SDfile   Computed 3D by Vconf -m prep SDfile
Find this compound or compounds like it in BindingDB:
Activity Spreadsheet -- Enzyme Inhibition Constant Data from BindingDB
Found 2 hits for monomerid = 168282
TargetMAP kinase-interacting serine/threonine-protein kinase 2(Homo sapiens (Human))
Effector Therapeutics
US Patent
LigandPNGBDBM168282(US9669031, 110 8-chloro-4′,4′-difluoro...)
Affinity DataIC50: <10nMT: 2°C. Assay description: Compounds are screened for Mnk inhibition using the ADP-Glo kinase assay kit (Promega, catalogue No. V9101). All kinase reactions are performed in Re...
Ligand InfoPC cidPC sid
In DepthDetails US Patent
TargetMAP kinase-interacting serine/threonine-protein kinase 1(Homo sapiens (Human))
Effector Therapeutics
US Patent
LigandPNGBDBM168282(US9669031, 110 8-chloro-4′,4′-difluoro...)
Affinity DataIC50: <10nMT: 2°C. Assay description: Compounds are screened for Mnk inhibition using the ADP-Glo kinase assay kit (Promega, catalogue No. V9101). All kinase reactions are performed in Re...
Ligand InfoPC cidPC sid
In DepthDetails US Patent