BDBM168316 US9669031, 153 8-chloro-3,3-bis(2-hydroxyethyl)-6-(pyrimidin-4-ylamino)-2,3-dihydroimidazo[1,5-a]pyridine-1,5-dione (Cpd. No. 153)
SMILES COC(=O)CC1(CC(=O)OC)NC(=O)c2c(Cl)cc(Nc3ccncn3)c(=O)n12
InChI Key InChIKey=MARYFTQFXRHJEJ-UHFFFAOYSA-N
Data  1 IC50
  Tab Delimited (TSV)   2D SDfile   Computed 3D by Vconf -m prep SDfile
Find this compound or compounds like it in BindingDB:
Activity Spreadsheet -- Enzyme Inhibition Constant Data from BindingDB
Found 1 hit for monomerid = 168316
TargetMAP kinase-interacting serine/threonine-protein kinase 2(Homo sapiens (Human))
Effector Therapeutics
US Patent
LigandPNGBDBM168316(US9669031, 153 8-chloro-3,3-bis(2-hydroxyethyl)-6-...)
Affinity DataIC50: >100nMT: 2°C. Assay description: Compounds are screened for Mnk inhibition using the ADP-Glo kinase assay kit (Promega, catalogue No. V9101). All kinase reactions are performed in Re...
Ligand InfoPC cidPC sid
In DepthDetails US Patent