BDBM168604 US9073939, 3
SMILES COc1n[nH]c2ccc(cc12)C1c2cnoc2NC(C)=C1[N+]#[C-]
InChI Key
Data  1 IC50
  Tab Delimited (TSV)   2D SDfile   Computed 3D by Vconf -m prep SDfile
Find this compound or compounds like it in BindingDB:
Activity Spreadsheet -- Enzyme Inhibition Constant Data from BindingDB
Found 1 hit for monomerid = 168604
TargetHepatocyte growth factor receptor(Homo sapiens (Human))
Bayer Intellectual Property
US Patent
LigandPNGBDBM168604(US9073939, 3)
Affinity DataIC50:  1nMpH: 7.0 T: 2°C. Assay description: Recombinant human c-Met protein (Invitrogen, Carlsbad, Calif., USA) is used. As substrate for the kinase reaction the peptide KKKSPGEYVNIEFG (JPT, Ge...
In DepthDetails US Patent