BDBM169469 US9079880, 2
SMILES COc1ccc(cc1Cl)C(=O)N[C@H](C1CC1)c1cccc(c1)C(=O)Nc1nc2CCN(C)Cc2s1
InChI Key InChIKey=LCCNJTIEMUTVAZ-HSZRJFAPSA-N
Data  1 IC50
  Tab Delimited (TSV)   2D SDfile   Computed 3D by Vconf -m prep SDfile
Find this compound or compounds like it in BindingDB:
Activity Spreadsheet -- Enzyme Inhibition Constant Data from BindingDB
Found 1 hit for monomerid = 169469
TargetRho-associated protein kinase 2(Homo sapiens (Human))
Boehringer Ingelheim International
US Patent
LigandPNGBDBM169469(US9079880, 2)
Affinity DataIC50:  2.80nMpH: 7.5Assay Description:The activity of ROCKII (1-543) kinase was measured utilizing Cambrex PKLight ATP Detection Reagent, a homogeneous assay technology using luciferin-lu...
In DepthDetails US Patent