BDBM16983 5-{[(3Z)-5-(carbamoylamino)-2-oxo-2,3-dihydro-1H-indol-3-ylidene]methyl}-4-methyl-1H-pyrrole-3-carboxylic acid::Indolinone based compound, 2b
SMILES Cc1c(\C=C2/C(=O)Nc3ccc(NC(N)=O)cc23)[nH]cc1C(O)=O
InChI Key InChIKey=HTFVUONILLSIET-YHYXMXQVSA-N
Data  1 IC50
  Tab Delimited (TSV)   2D SDfile   Computed 3D by Vconf -m prep SDfile
Find this compound or compounds like it in BindingDB:
Activity Spreadsheet -- Enzyme Inhibition Constant Data from BindingDB
Found 1 hit for monomerid = 16983
Target3-phosphoinositide-dependent protein kinase 1(Homo sapiens (Human))
Berlex Biosciences
LigandPNGBDBM16983(5-{[(3Z)-5-(carbamoylamino)-2-oxo-2,3-dihydro-1H-i...)
Affinity DataIC50:  9nMpH: 7.2 T: 2°C. Assay description: The coupled assay can detect inhibitors of AKT2 activation, as well as direct inhibitors of PDK1 or AKT2. Inactive AKT2 is activated in situ by incub...
In DepthDetails ArticlePubMed