BDBM169889 US9073940, 238
SMILES OC(=O)c1nn(c-2c1CS(=O)(=O)c1ccccc-21)-c1ccc(CN2CCOCC2)cc1
InChI Key InChIKey=GDDUJNNRYRBMCG-UHFFFAOYSA-N
Data  1 IC50
  Tab Delimited (TSV)   2D SDfile   Computed 3D by Vconf -m prep SDfile
Find this compound or compounds like it in BindingDB:
Activity Spreadsheet -- Enzyme Inhibition Constant Data from BindingDB
Found 1 hit for monomerid = 169889
LigandPNGBDBM169889(US9073940, 238)
Affinity DataIC50:  4.04E+3nM. Assay description: The efficacy of compounds of the invention in inhibiting the PI3K induced-lipid phosphorylation may be tested in the following binding assay. The ass...
In DepthDetails US Patent