BDBM170050 US9073940, 402
SMILES O=C(N1CCOCC1)c1nn([C@H]2CCN(C2)C2CCOCC2)c-2c1CS(=O)(=O)c1ccccc-21
InChI Key InChIKey=UDDJJHILDQDTBM-SFHVURJKSA-N
Data  1 IC50
  Tab Delimited (TSV)   2D SDfile   Computed 3D by Vconf -m prep SDfile
Find this compound or compounds like it in BindingDB:
Activity Spreadsheet -- Enzyme Inhibition Constant Data from BindingDB
Found 1 hit for monomerid = 170050
LigandPNGBDBM170050(US9073940, 402)
Affinity DataIC50:  1.44E+3nM. Assay description: The efficacy of compounds of the invention in inhibiting the PI3K induced-lipid phosphorylation may be tested in the following binding assay. The ass...
In DepthDetails US Patent