BDBM170088 US9073940, 446
SMILES COC1CN(CCN2CCC[C@@H](C2)n2nc(C(=O)N3CCOCC3)c3CS(=O)(=O)c4ccccc4-c23)C1
InChI Key InChIKey=JLOYLMZLENULHD-IBGZPJMESA-N
Data  1 IC50
  Tab Delimited (TSV)   2D SDfile   Computed 3D by Vconf -m prep SDfile
Find this compound or compounds like it in BindingDB:
Activity Spreadsheet -- Enzyme Inhibition Constant Data from BindingDB
Found 1 hit for monomerid = 170088
LigandPNGBDBM170088(US9073940, 446)
Affinity DataIC50:  20nM. Assay description: The efficacy of compounds of the invention in inhibiting the PI3K induced-lipid phosphorylation may be tested in the following binding assay. The ass...
In DepthDetails US Patent