BDBM170564 US9085549, 82
SMILES Oc1ccc(cc1O)-c1cnc(s1)-c1cc(O)c(O)cc1Br
InChI Key InChIKey=JPXUJSPDZHMJPH-UHFFFAOYSA-N
Data  1 KI
  Tab Delimited (TSV)   2D SDfile   Computed 3D by Vconf -m prep SDfile
Find this compound or compounds like it in BindingDB:
Activity Spreadsheet -- Enzyme Inhibition Constant Data from BindingDB
Found 1 hit for monomerid = 170564
TargetAlpha-synuclein(Homo sapiens (Human))
Proteotech
US Patent
LigandPNGBDBM170564(US9085549, 82)
Affinity DataKi:  177nMpH: 7.4Assay Description:The compounds prepared in the preceding examples were found to bind with high affinity to α-synuclein aggregates/fibrils that are found in the h...
In DepthDetails US Patent