BDBM170571 US9085549, 95
SMILES Oc1ccc(cc1O)C(=O)\C=C\c1cc(O)c(O)cc1Br
InChI Key InChIKey=LLLJKOIYSCTHDB-HNQUOIGGSA-N
Data  1 KI  1 IC50
  Tab Delimited (TSV)   2D SDfile   Computed 3D by Vconf -m prep SDfile
Find this compound or compounds like it in BindingDB:
Activity Spreadsheet -- Enzyme Inhibition Constant Data from BindingDB
Found 2 hits for monomerid = 170571
TargetAlpha-synuclein(Homo sapiens (Human))
Proteotech
US Patent
LigandPNGBDBM170571(US9085549, 95)
Affinity DataKi:  890nMpH: 7.4Assay Description:The compounds prepared in the preceding examples were found to bind with high affinity to α-synuclein aggregates/fibrils that are found in the h...
In DepthDetails US Patent
TargetMicrotubule-associated protein tau(Homo sapiens (Human))
Proteotech
US Patent
LigandPNGBDBM170571(US9085549, 95)
Affinity DataIC50:  9.02E+3nM. Assay description: The Thio S fluorometry assay as a primary screening method to identify tau protein aggregation inhibitors from our small molecule library. Aggregated...
In DepthDetails US Patent