BDBM170621 US9085555, 46
SMILES N[C@H]1C[C@H](N(C1)C(=O)Nc1cn(C(N)=O)c2ccccc12)C(=O)NCc1ccc(OC(F)(F)F)cc1
InChI Key InChIKey=AWOUNODDBWSXDY-LIRRHRJNSA-N
Data  1 IC50
  Tab Delimited (TSV)   2D SDfile   Computed 3D by Vconf -m prep SDfile
Find this compound or compounds like it in BindingDB:
Activity Spreadsheet -- Enzyme Inhibition Constant Data from BindingDB
Found 1 hit for monomerid = 170621
TargetComplement factor D(Homo sapiens (Human))
Novartis
US Patent
LigandPNGBDBM170621(US9085555, 46)
Affinity DataIC50:  2.28E+4nMpH: 7.5 T: 2°C. Assay description: Recombinant human factor D (expressed in E. coli and purified using standard methods) at 10 nM concentration is incubated with test compound at vario...
In DepthDetails US Patent