BDBM171069 US9085555, 499
SMILES COc1ccc2c(cn(CC(=O)N3C[C@H](F)C[C@H]3C(=O)NCc3cccc(Cl)c3F)c2c1)C(N)=O
InChI Key InChIKey=KYBVYBRCNCXRSL-VLIAUNLRSA-N
Data  1 IC50
  Tab Delimited (TSV)   2D SDfile   Computed 3D by Vconf -m prep SDfile
Find this compound or compounds like it in BindingDB:
Activity Spreadsheet -- Enzyme Inhibition Constant Data from BindingDB
Found 1 hit for monomerid = 171069
TargetComplement factor D(Homo sapiens (Human))
Novartis
US Patent
LigandPNGBDBM171069(US9085555, 499)
Affinity DataIC50:  36nMpH: 7.5 T: 2°C. Assay description: Recombinant human factor D (expressed in E. coli and purified using standard methods) at 10 nM concentration is incubated with test compound at vario...
In DepthDetails US Patent