BDBM171151 US9085555, 581
SMILES CC(=O)c1cn(CC(=O)N2[C@@H]3CC3C[C@H]2C(=O)NCc2cccc(Cl)c2F)c2ccc(O)cc12
InChI Key InChIKey=QESHFNIHJQIFSV-LQJNRQTASA-N
Data  1 IC50
  Tab Delimited (TSV)   2D SDfile   Computed 3D by Vconf -m prep SDfile
Find this compound or compounds like it in BindingDB:
Activity Spreadsheet -- Enzyme Inhibition Constant Data from BindingDB
Found 1 hit for monomerid = 171151
TargetComplement factor D(Homo sapiens (Human))
Novartis
US Patent
LigandPNGBDBM171151(US9085555, 581)
Affinity DataIC50:  60nMpH: 7.5 T: 2°C. Assay description: Recombinant human factor D (expressed in E. coli and purified using standard methods) at 10 nM concentration is incubated with test compound at vario...
In DepthDetails US Patent