BDBM171283 US9085555, 713
SMILES Cc1cc2n(CC(=O)N3[C@@H]4C[C@@H]4C[C@H]3C(=O)Nc3cccc(OC(F)(F)F)c3F)nc(C(N)=O)c2cn1
InChI Key InChIKey=VZHVEBXTGDORAE-XFJVYGCCSA-N
Data  1 IC50
  Tab Delimited (TSV)   2D SDfile   Computed 3D by Vconf -m prep SDfile
Find this compound or compounds like it in BindingDB:
Activity Spreadsheet -- Enzyme Inhibition Constant Data from BindingDB
Found 1 hit for monomerid = 171283
TargetComplement factor D(Homo sapiens (Human))
Novartis
US Patent
LigandPNGBDBM171283(US9085555, 713)
Affinity DataIC50:  260nMpH: 7.5 T: 2°C. Assay description: Recombinant human factor D (expressed in E. coli and purified using standard methods) at 10 nM concentration is incubated with test compound at vario...
In DepthDetails US Patent