BDBM171334 US9085555, 764
SMILES NC(=O)n1cc(NC(=O)N2C[C@H](F)C[C@H]2C(=O)Nc2cccc(Br)n2)c2ccccc12
InChI Key InChIKey=NUCPVHUPYSHYBF-ABAIWWIYSA-N
Data  1 IC50
  Tab Delimited (TSV)   2D SDfile   Computed 3D by Vconf -m prep SDfile
Find this compound or compounds like it in BindingDB:
Activity Spreadsheet -- Enzyme Inhibition Constant Data from BindingDB
Found 1 hit for monomerid = 171334
TargetComplement factor D(Homo sapiens (Human))
Novartis
US Patent
LigandPNGBDBM171334(US9085555, 764)
Affinity DataIC50:  4nMpH: 7.5 T: 2°C. Assay description: Recombinant human factor D (expressed in E. coli and purified using standard methods) at 10 nM concentration is incubated with test compound at vario...
In DepthDetails US Patent