BDBM171461 US9085576, 95::US9611261, Example 95
SMILES NC1=N[C@@](C(F)F)([C@H]2C[C@H]2O1)c1cc(NC(=O)c2cnc(OCC#C)cn2)ccc1F
InChI Key InChIKey=FYACCYJZRVOAOP-PGICJIBASA-N
Data  4 IC50
  Tab Delimited (TSV)   2D SDfile   Computed 3D by Vconf -m prep SDfile
Find this compound or compounds like it in BindingDB:
Activity Spreadsheet -- Enzyme Inhibition Constant Data from BindingDB
Found 4 hits for monomerid = 171461
TargetBeta-secretase 1(Homo sapiens (Human))
Amgen
US Patent
LigandPNGBDBM171461(US9085576, 95 | US9611261, Example 95)
Affinity DataIC50:  3.5nMpH: 4.2Assay Description:The assay buffer used in this screen is 0.05 M acetate, pH 4.2, 10% DMSO final, 100 uM genapol (which is a nonionic detergent, below its Critical Mic...
In DepthDetails US Patent
TargetCathepsin D(Homo sapiens (Human))
Amgen
US Patent
LigandPNGBDBM171461(US9085576, 95 | US9611261, Example 95)
Affinity DataIC50:  1.43E+5nM. Assay description: Recombinant Cat D was expressed in CHO cells. The assay buffer for CathepsinD is 0.05 M citrate pH 3.5, 10% DMSO final, 5 mM CHAPS. The Cat D enzyme ...
In DepthDetails US Patent
TargetBeta-secretase 1(Homo sapiens (Human))
Amgen
US Patent
LigandPNGBDBM171461(US9085576, 95 | US9611261, Example 95)
Affinity DataIC50:  3.5nM. Assay description: The assay buffer used in this screen is 0.05 M acetate, pH 4.2, 10% DMSO final, 100 uM genapol (which is a nonionic detergent, below its Critical Mic...
In DepthDetails US Patent
TargetCathepsin D(Homo sapiens (Human))
Amgen
US Patent
LigandPNGBDBM171461(US9085576, 95 | US9611261, Example 95)
Affinity DataIC50:  1.43E+5nMpH: 3.5Assay Description:Recombinant Cat D was expressed in CHO cells. The assay buffer for CathepsinD is 0.05 M citrate pH 3.5, 10% DMSO final, 5 mM CHAPS. The Cat D enzyme ...
In DepthDetails US Patent